Reaction Details
TargetEctonucleotide pyrophosphatase/phosphodiesterase family member 2
LigandBDBM258479
Substrate/Competitorn/a
Meas. Tech.Enzyme Inhibition Assay
pH8±n/a
Temperature303.15±n/a K
IC50 15±n/a nM
Commentsextracted
Citation Hunziker, DMattei, PMauser, HPrunotto, MUllmer, C Diazaspirocycloalkane and azaspirocycloalkane US Patent US9493486 Publication Date 11/15/2016
 
Ectonucleotide pyrophosphatase/phosphodiesterase family member 2
Name:Ectonucleotide pyrophosphatase/phosphodiesterase family member 2
Type:Enzyme
Mol. Mass.:99007.13
Organism:Homo sapiens (Human)
Description:Q13822
Residue:863
BDBM258479
NameBDBM258479
Synonyms:US10633384, Example 1 | US9493486, 1
TypeSmall organic molecule
Emp. Form.C22H21Cl2N5O3
Mol. Mass.474.34
SMILESClc1cc(Cl)cc(COC(=O)N2CCC3(CN(C3)C(=O)c3ccc4[nH]nnc4c3)CC2)c1