Reaction Details
TargetEctonucleotide pyrophosphatase/phosphodiesterase family member 2
LigandBDBM258491
Substrate/Competitorn/a
Meas. Tech.Enzyme Inhibition Assay
pH8±n/a
Temperature303.15±n/a K
IC50 35±n/a nM
Commentsextracted
Citation Hunziker, DMattei, PMauser, HPrunotto, MUllmer, C Diazaspirocycloalkane and azaspirocycloalkane US Patent US9493486 Publication Date 11/15/2016
 
Ectonucleotide pyrophosphatase/phosphodiesterase family member 2
Name:Ectonucleotide pyrophosphatase/phosphodiesterase family member 2
Type:Enzyme
Mol. Mass.:99007.13
Organism:Homo sapiens (Human)
Description:Q13822
Residue:863
BDBM258491
NameBDBM258491
Synonyms:US10633384, Example 1.12 | US9493486, 1.12
TypeSmall organic molecule
Emp. Form.C21H19Cl2N5O3
Mol. Mass.460.313
SMILESClc1cc(Cl)cc(COC(=O)NC2CC3(C2)CN(C3)C(=O)c2ccc3[nH]nnc3c2)c1