Reaction Details
TargetEctonucleotide pyrophosphatase/phosphodiesterase family member 2
LigandBDBM258520
Substrate/Competitorn/a
Meas. Tech.Enzyme Inhibition Assay
pH8±n/a
Temperature303.15±n/a K
IC50 26.5±n/a nM
Commentsextracted
Citation Hunziker, DMattei, PMauser, HPrunotto, MUllmer, C Diazaspirocycloalkane and azaspirocycloalkane US Patent US9493486 Publication Date 11/15/2016
 
Ectonucleotide pyrophosphatase/phosphodiesterase family member 2
Name:Ectonucleotide pyrophosphatase/phosphodiesterase family member 2
Type:Enzyme
Mol. Mass.:99007.13
Organism:Homo sapiens (Human)
Description:Q13822
Residue:863
BDBM258520
NameBDBM258520
Synonyms:US10633384, Example 5.2 | US9493486, 5.2
TypeSmall organic molecule
Emp. Form.C22H19Cl2N3O5
Mol. Mass.476.309
SMILESClc1cc(Cl)cc(COC(=O)N2CC3(CC(C3)NC(=O)c3ccc4[nH]c(=O)oc4c3)C2)c1