Reaction Details
TargetEctonucleotide pyrophosphatase/phosphodiesterase family member 2
LigandBDBM258564
Substrate/Competitorn/a
Meas. Tech.Enzyme Inhibition Assay
pH8±n/a
Temperature303.15±n/a K
IC50 53±n/a nM
Commentsextracted
Citation Hunziker, DMattei, PMauser, HPrunotto, MUllmer, C Diazaspirocycloalkane and azaspirocycloalkane US Patent US9493486 Publication Date 11/15/2016
 
Ectonucleotide pyrophosphatase/phosphodiesterase family member 2
Name:Ectonucleotide pyrophosphatase/phosphodiesterase family member 2
Type:Enzyme
Mol. Mass.:99007.13
Organism:Homo sapiens (Human)
Description:Q13822
Residue:863
BDBM258564
NameBDBM258564
Synonyms:US10633384, Example 12.26 | US9493486, 12.26
TypeSmall organic molecule
Emp. Form.C25H24F3N3O7S
Mol. Mass.567.534
SMILESCS(=O)(=O)c1cc(COC(=O)N2CCC3(CN(C3)C(=O)c3ccc4[nH]c(=O)oc4c3)CC2)cc(c1)C(F)(F)F