Reaction Details
TargetEctonucleotide pyrophosphatase/phosphodiesterase family member 2
LigandBDBM258573
Substrate/Competitorn/a
Meas. Tech.Enzyme Inhibition Assay
pH8±n/a
Temperature303.15±n/a K
IC50 4.5±n/a nM
Commentsextracted
Citation Hunziker, DMattei, PMauser, HPrunotto, MUllmer, C Diazaspirocycloalkane and azaspirocycloalkane US Patent US9493486 Publication Date 11/15/2016
 
Ectonucleotide pyrophosphatase/phosphodiesterase family member 2
Name:Ectonucleotide pyrophosphatase/phosphodiesterase family member 2
Type:Enzyme
Mol. Mass.:99007.13
Organism:Homo sapiens (Human)
Description:Q13822
Residue:863
BDBM258573
NameBDBM258573
Synonyms:US10633384, Example 12.35 | US9493486, 12.35
TypeSmall organic molecule
Emp. Form.C23H28F3N5O3
Mol. Mass.479.4953
SMILESFC(F)(F)c1ccc(COC(=O)N2CCC3(CN(C3)C(=O)C3CCC4NN=NC4C3)CC2)cc1