Reaction Details
TargetEctonucleotide pyrophosphatase/phosphodiesterase family member 2
LigandBDBM258588
Substrate/Competitorn/a
Meas. Tech.Enzyme Inhibition Assay
pH8±n/a
Temperature303.15±n/a K
IC50 16±n/a nM
Commentsextracted
Citation Hunziker, DMattei, PMauser, HPrunotto, MUllmer, C Diazaspirocycloalkane and azaspirocycloalkane US Patent US9493486 Publication Date 11/15/2016
 
Ectonucleotide pyrophosphatase/phosphodiesterase family member 2
Name:Ectonucleotide pyrophosphatase/phosphodiesterase family member 2
Type:Enzyme
Mol. Mass.:99007.13
Organism:Homo sapiens (Human)
Description:Q13822
Residue:863
BDBM258588
NameBDBM258588
Synonyms:US9493486, 15A
TypeSmall organic molecule
Emp. Form.C23H25F4N5O4
Mol. Mass.511.4693
SMILESFc1cc(OC(F)(F)F)ccc1COC(=O)N1CCC2(CN(C2)C(=O)[C@H]2CCc3[nH]nnc3C2)CC1