Reaction Details
TargetcAMP-dependent protein kinase catalytic subunit alpha
LigandBDBM258596
Substrate/Competitorn/a
Meas. Tech.Competition Binding Assay
Temperature298.15±n/a K
IC50 6.09±n/a nM
Commentsextracted
Citation Akama, TJarnagin, KZhang, YZhou, YPlattner, JJSullivan, DC Boron-containing small molecules US Patent US9493490 Publication Date 11/15/2016
 
cAMP-dependent protein kinase catalytic subunit alpha
Name:cAMP-dependent protein kinase catalytic subunit alpha
Type:Enzyme Catalytic Subunit
Mol. Mass.:40598.73
Organism:Homo sapiens (Human)
Description:n/a
Residue:351
BDBM258596
NameBDBM258596
Synonyms:US9493490, 6-(4-(1-aminoethyl)-2-fluorophenoxy)-7-methylbenzo[c][1,2]oxaborol-1(3H)-ol US9493490, Example 5
TypeSmall organic molecule
Emp. Form.C16H17BFNO3
Mol. Mass.301.12
SMILESCC(N)c1ccc(Oc2ccc3COB(O)c3c2C)c(F)c1