Reaction Details
TargetProtein kinase C alpha type
LigandBDBM258598
Substrate/Competitorn/a
Meas. Tech.Competition Binding Assay
Temperature298.15±n/a K
IC50 15.64±n/a nM
Commentsextracted
Citation Akama, TJarnagin, KZhang, YZhou, YPlattner, JJSullivan, DC Boron-containing small molecules US Patent US9493490 Publication Date 11/15/2016
 
Protein kinase C alpha type
Name:Protein kinase C alpha type
Type:Enzyme
Mol. Mass.:76755.65
Organism:Homo sapiens (Human)
Description:The recombinant human PKC enzymes were produced using a baculovirus expression system in SF9 cells
Residue:672
BDBM258598
NameBDBM258598
Synonyms:US9493490, Example 10 | US9493490, G
TypeSmall organic molecule
Emp. Form.C16H17BFNO3
Mol. Mass.301.12
SMILESC[C@@H](N)c1ccc(Oc2ccc3COB(O)c3c2C)c(F)c1