Reaction Details
TargetRibosomal protein S6 kinase alpha-1
LigandBDBM258598
Substrate/Competitorn/a
Meas. Tech.Competition Binding Assay
Temperature298.15±n/a K
IC50 3.62±n/a nM
Commentsextracted
Citation Akama, TJarnagin, KZhang, YZhou, YPlattner, JJSullivan, DC Boron-containing small molecules US Patent US9493490 Publication Date 11/15/2016
 
Ribosomal protein S6 kinase alpha-1
Name:Ribosomal protein S6 kinase alpha-1
Type:Serine/threonine-protein kinase
Mol. Mass.:82736.10
Organism:Homo sapiens (Human)
Description:n/a
Residue:735
BDBM258598
NameBDBM258598
Synonyms:US9493490, Example 10 | US9493490, G
TypeSmall organic molecule
Emp. Form.C16H17BFNO3
Mol. Mass.301.12
SMILESC[C@@H](N)c1ccc(Oc2ccc3COB(O)c3c2C)c(F)c1