Reaction Details
TargetMelanin-concentrating hormone receptor 1 [E4Q,A5T]
LigandBDBM258778
Substrate/Competitorn/a
Meas. Tech.Radioligand Binding Assay
pH7.4±n/a
Ki 0.4±n/a nM
Commentsextracted
Citation Washburn, WNMurugaiah Subbaiah, MAAhmad, S Pyrrolone or pyrrolidinone melanin concentrating hormone receptor-1 antagonists US Patent US9499482 Publication Date 11/22/2016
 
Melanin-concentrating hormone receptor 1 [E4Q,A5T]
Name:Melanin-concentrating hormone receptor 1 [E4Q,A5T]
Type:Enzyme
Mol. Mass.:46077.38
Organism:Homo sapiens (Human)
Description:Q99705 (E4Q, A5T)
Residue:422
BDBM258778
NameBDBM258778
Synonyms:US9499482, 184
TypeSmall organic molecule
Emp. Form.C26H28F2N2O4
Mol. Mass.470.5083
SMILESFC(F)Oc1cc(ccc1OCCN1CCCC1)N1CC=C(Oc2ccc(cc2)C2CC2)C1=O