Reaction Details
TargetBeta-secretase 1
LigandBDBM258900
Substrate/Competitorn/a
Meas. Tech.BACE1 HTRF FRET Assay
pH5±n/a
Temperature303.15±n/a K
Ki 4.6±n/a nM
Commentsextracted
Citation Wu, WBurnett, DAStamford, AWCumming, JNBennett, CEGilbert, EJScott, JDYu, YPeng, X 5-substituted iminothiazines and their mono- and dioxides as BACE inhibitors, compositions, and their use US Patent US9499502 Publication Date 11/22/2016
 
Beta-secretase 1
Name:Beta-secretase 1
Type:Protein
Mol. Mass.:55755.10
Organism:Homo sapiens (Human)
Description:P56817
Residue:501
BDBM258900
NameBDBM258900
Synonyms:US9499502, 9a
TypeSmall organic molecule
Emp. Form.C20H23FN4O4S
Mol. Mass.434.484
SMILESCOc1ccc(nc1)C(=O)Nc1ccc(F)c(c1)[C@]1(C)CS(=O)(=O)C(C)(C)C(=N)N1