Reaction Details
TargetBeta-secretase 1
LigandBDBM258901
Substrate/Competitorn/a
Meas. Tech.BACE1 HTRF FRET Assay
pH5±n/a
Temperature303.15±n/a K
Ki<0.5±n/a nM
Commentsextracted
Citation Wu, WBurnett, DAStamford, AWCumming, JNBennett, CEGilbert, EJScott, JDYu, YPeng, X 5-substituted iminothiazines and their mono- and dioxides as BACE inhibitors, compositions, and their use US Patent US9499502 Publication Date 11/22/2016
 
Beta-secretase 1
Name:Beta-secretase 1
Type:Protein
Mol. Mass.:55755.10
Organism:Homo sapiens (Human)
Description:P56817
Residue:501
BDBM258901
NameBDBM258901
Synonyms:US9499502, 9b
TypeSmall organic molecule
Emp. Form.C20H20FN5O3S
Mol. Mass.429.468
SMILESCC1(C)C(=N)N[C@@](C)(CS1(=O)=O)c1cc(NC(=O)c2ccc(cn2)C#N)ccc1F