Reaction Details
TargetBeta-secretase 1
LigandBDBM258997
Substrate/Competitorn/a
Meas. Tech.BACE1 HTRF FRET Assay
pH5±n/a
Temperature303.15±n/a K
Ki 1.6±n/a nM
Commentsextracted
Citation Wu, WBurnett, DAStamford, AWCumming, JNBennett, CEGilbert, EJScott, JDYu, YPeng, X 5-substituted iminothiazines and their mono- and dioxides as BACE inhibitors, compositions, and their use US Patent US9499502 Publication Date 11/22/2016
 
Beta-secretase 1
Name:Beta-secretase 1
Type:Protein
Mol. Mass.:55755.10
Organism:Homo sapiens (Human)
Description:P56817
Residue:501
BDBM258997
NameBDBM258997
Synonyms:US9499502, 9cs-a
TypeSmall organic molecule
Emp. Form.C24H28ClFN4O4S
Mol. Mass.523.02
SMILESC[C@]1(CS(=O)(=O)[C@@](C)(CC2CCOCC2)C(=N)N1)c1cc(NC(=O)c2ccc(Cl)cn2)ccc1F