Reaction Details
TargetBeta-secretase 1
LigandBDBM259020
Substrate/Competitorn/a
Meas. Tech.BACE1 HTRF FRET Assay
pH5±n/a
Temperature303.15±n/a K
Ki 2.3±n/a nM
Commentsextracted
Citation Wu, WBurnett, DAStamford, AWCumming, JNBennett, CEGilbert, EJScott, JDYu, YPeng, X 5-substituted iminothiazines and their mono- and dioxides as BACE inhibitors, compositions, and their use US Patent US9499502 Publication Date 11/22/2016
 
Beta-secretase 1
Name:Beta-secretase 1
Type:Protein
Mol. Mass.:55755.10
Organism:Homo sapiens (Human)
Description:P56817
Residue:501
BDBM259020
NameBDBM259020
Synonyms:US9499502, 9df-a
TypeSmall organic molecule
Emp. Form.C24H21F3N4O3S
Mol. Mass.502.509
SMILESC[C@]1(CS(=O)(=O)[C@](C)(C(=N)N1)c1ccc(F)cc1)c1cc(NC(=O)c2ccc(F)cn2)ccc1F