Reaction Details
TargetDual specificity protein kinase TTK/Glutathione S-transferase P
LigandBDBM50042932
Substrate/Competitorn/a
Meas. Tech.Time-Resolved Fluorescence Resonance Energy Transfer (TR-FRET) Assay
pH7.7±n/a
Temperature295.15±n/a K
IC50 0.7±n/a nM
Commentsextracted
Citation Koppitz, MKlar, UWengner, AMNeuhaus, RSiemeister, G Substituted imidazopyridazines US Patent US9512126 Publication Date 12/6/2016
 
Dual specificity protein kinase TTK/Glutathione S-transferase P
Name:Dual specificity protein kinase TTK/Glutathione S-transferase P
Synonyms:GST-Dual specificity protein kinase TTK
Type:Protein
Mol. Mass.:n/a
Description:n/a
Components:This complex has 2 components.
Component 1
Name:Glutathione S-transferase P
Type:Enzyme
Mol. Mass.:23353.53
Organism:Homo sapiens (Human)
Description:P09211
Residue:210
Component 2
Name:Dual specificity protein kinase TTK
Synonyms:Dual specificity protein kinase (TTK) MPS1 Monopolar Spindle 1 (MPS1) Monopolar Spindle 1 Kinase (MPS1) TTK | TTK_HUMAN
Type:Protein
Mol. Mass.:97086.79
Organism:Homo sapiens (Human)
Description:P33981
Residue:857
BDBM50042932
NameBDBM50042932
Synonyms:CHEMBL3354996 | US9512126, 17
TypeSmall organic molecule
Emp. Form.C29H26F5N5O
Mol. Mass.555.5417
SMILESCc1cc(ccc1C(=O)NC1CC1)-c1cnc2c(NCCC(F)(F)F)cc(nn12)C1(CC1)c1cccc(F)c1F