Reaction Details
TargetPoly [ADP-ribose] polymerase tankyrase-2 [946-1162]
LigandBDBM259579
Substrate/Competitorn/a
Meas. Tech.Biochemical Assay
IC50 0.796±n/a nM
Citation Bregman, HBuchanan, JLChakka, NDimauro, EFGunaydin, HGuzman-Perez, AHua, ZHuang, X Quinazolinone compounds and derivatives thereof US Patent US9505749 Publication Date 11/29/2016
 
Poly [ADP-ribose] polymerase tankyrase-2 [946-1162]
Name:Poly [ADP-ribose] polymerase tankyrase-2 [946-1162]
Type:Enzyme
Mol. Mass.:24581.05
Organism:Homo sapiens (Human)
Description:aa 946-1162
Residue:217
BDBM259579
NameBDBM259579
Synonyms:US9505749, 90
TypeSmall organic molecule
Emp. Form.C24H24ClN5O3S
Mol. Mass.497.997
SMILESClc1ccc2n([C@H]3CC[C@@H](CC3)NC(=O)CCSc3nc4ccccc4c(=O)[nH]3)c(=O)[nH]c2c1