Reaction Details
TargetRibosomal protein S6 kinase alpha-3 [399-740]
LigandBDBM50403059
Substrate/Competitorn/a
Meas. Tech.RSK2 Inhibition Assay
pH8±n/a
Temperature295.15±n/a K
IC50 4.5±n/a nM
Commentsextracted
Citation Taunton, Jr., JWMaglathlin, RSerafimova, ICohen, MSMiller, RPaavilainen, VMcFarland, JKrishnan, S Kinase inhibitors US Patent US9505766 Publication Date 11/29/2016
 
Ribosomal protein S6 kinase alpha-3 [399-740]
Name:Ribosomal protein S6 kinase alpha-3 [399-740]
Type:Enzyme
Mol. Mass.:38435.14
Organism:Homo sapiens (Human)
Description:aa 399-740; RSK2 C-terminal kinase domain (CTD)
Residue:342
BDBM50403059
NameBDBM50403059
Synonyms:CHEMBL2216829 | US9505766, 64
TypeSmall organic molecule
Emp. Form.C24H28N6O2
Mol. Mass.432.5181
SMILESCc1ccc(cc1)-c1c(\C=C(/C#N)C(=O)NC(C)(C)C)n(CCCO)c2ncnc(N)c12