Reaction Details
TargetRibosomal protein S6 kinase alpha-3 [399-740]
LigandBDBM259867
Substrate/Competitorn/a
Meas. Tech.RSK2 Inhibition Assay
pH8±n/a
Temperature295.15±n/a K
IC50 17±n/a nM
Commentsextracted
Citation Taunton, Jr., JWMaglathlin, RSerafimova, ICohen, MSMiller, RPaavilainen, VMcFarland, JKrishnan, S Kinase inhibitors US Patent US9505766 Publication Date 11/29/2016
 
Ribosomal protein S6 kinase alpha-3 [399-740]
Name:Ribosomal protein S6 kinase alpha-3 [399-740]
Type:Enzyme
Mol. Mass.:38435.14
Organism:Homo sapiens (Human)
Description:aa 399-740; RSK2 C-terminal kinase domain (CTD)
Residue:342
BDBM259867
NameBDBM259867
Synonyms:US9505766, 72
TypeSmall organic molecule
Emp. Form.C23H26N6O3
Mol. Mass.434.4909
SMILESCN(CCO)C(=O)C(=C\c1c(-c2ccc(C)cc2)c2c(N)ncnc2n1CCCO)\C#N