Reaction Details
TargetGlutaminyl-peptide cyclotransferase
LigandBDBM259917
Substrate/Competitorn/a
Meas. Tech.Fluorometric Assays
pH6±n/a
Temperature303.15±n/a K
Ki 10.39±n/a nM
Commentsextracted
Citation Heiser, UBuchholz, MSommer, RMeyer, ADemuth, H Inhibitors US Patent US9512115 Publication Date 12/6/2016
 
Glutaminyl-peptide cyclotransferase
Name:Glutaminyl-peptide cyclotransferase
Type:Enzyme
Mol. Mass.:40877.05
Organism:Homo sapiens (Human)
Description:Q16769
Residue:361
BDBM259917
NameBDBM259917
Synonyms:US9512115, 21
TypeSmall organic molecule
Emp. Form.C20H17F3N4O2
Mol. Mass.402.3698
SMILESFc1cc(ccc1N1CCC(F)(F)C1)[C@H]1COC(=O)N1c1ccc2[nH]cnc2c1