Reaction Details
TargetGlutaminyl-peptide cyclotransferase
LigandBDBM259922
Substrate/Competitorn/a
Meas. Tech.Fluorometric Assays
pH6±n/a
Temperature303.15±n/a K
Ki 13.56±n/a nM
Commentsextracted
Citation Heiser, UBuchholz, MSommer, RMeyer, ADemuth, H Inhibitors US Patent US9512115 Publication Date 12/6/2016
 
Glutaminyl-peptide cyclotransferase
Name:Glutaminyl-peptide cyclotransferase
Type:Enzyme
Mol. Mass.:40877.05
Organism:Homo sapiens (Human)
Description:Q16769
Residue:361
BDBM259922
NameBDBM259922
Synonyms:US9512115, 26
TypeSmall organic molecule
Emp. Form.C22H20F3N3O2
Mol. Mass.415.4083
SMILESFc1cc(ccc1C1CCC(F)(F)CC1)[C@H]1COC(=O)N1c1ccc2[nH]cnc2c1