Reaction Details
TargetGlutaminyl-peptide cyclotransferase
LigandBDBM259900
Substrate/Competitorn/a
Meas. Tech.Fluorometric Assays
pH8±n/a
Temperature303.15±n/a K
Ki 5.0169±n/a nM
Commentsextracted
Citation Heiser, UBuchholz, MSommer, RMeyer, ADemuth, H Inhibitors US Patent US9512115 Publication Date 12/6/2016
 
Glutaminyl-peptide cyclotransferase
Name:Glutaminyl-peptide cyclotransferase
Type:Enzyme
Mol. Mass.:40877.05
Organism:Homo sapiens (Human)
Description:Q16769
Residue:361
BDBM259900
NameBDBM259900
Synonyms:US9512115, 3
TypeSmall organic molecule
Emp. Form.C20H18F3N3O3
Mol. Mass.405.3704
SMILESCC(F)(F)CCOc1ccc([C@H]2COC(=O)N2c2ccc3[nH]cnc3c2)c(F)c1