Reaction Details
TargetGlutaminyl-peptide cyclotransferase
LigandBDBM259903
Substrate/Competitorn/a
Meas. Tech.Fluorometric Assays
pH8±n/a
Temperature303.15±n/a K
Ki 6.7076±n/a nM
Commentsextracted
Citation Heiser, UBuchholz, MSommer, RMeyer, ADemuth, H Inhibitors US Patent US9512115 Publication Date 12/6/2016
 
Glutaminyl-peptide cyclotransferase
Name:Glutaminyl-peptide cyclotransferase
Type:Enzyme
Mol. Mass.:40877.05
Organism:Homo sapiens (Human)
Description:Q16769
Residue:361
BDBM259903
NameBDBM259903
Synonyms:US9512115, 6
TypeSmall organic molecule
Emp. Form.C19H15F4N3O3
Mol. Mass.409.3343
SMILESCC(F)(F)COc1ccc([C@H]2COC(=O)N2c2ccc3[nH]cnc3c2)c(F)c1F