Reaction Details
TargetGlutaminyl-peptide cyclotransferase
LigandBDBM259916
Substrate/Competitorn/a
Meas. Tech.Fluorometric Assays
pH8±n/a
Temperature303.15±n/a K
Ki 5.2928±n/a nM
Commentsextracted
Citation Heiser, UBuchholz, MSommer, RMeyer, ADemuth, H Inhibitors US Patent US9512115 Publication Date 12/6/2016
 
Glutaminyl-peptide cyclotransferase
Name:Glutaminyl-peptide cyclotransferase
Type:Enzyme
Mol. Mass.:40877.05
Organism:Homo sapiens (Human)
Description:Q16769
Residue:361
BDBM259916
NameBDBM259916
Synonyms:US9512115, 20
TypeSmall organic molecule
Emp. Form.C20H16F4N4O2
Mol. Mass.420.3603
SMILESFc1cc(cc(F)c1[C@H]1COC(=O)N1c1ccc2[nH]cnc2c1)N1CCC(F)(F)C1