Reaction Details
TargetDual specificity protein phosphatase CDC14A
LigandBDBM50054344
Substrate/Competitorn/a
Meas. Tech.Inhibition Assay
IC50 16000±4000 nM
Citation Zhang, ZZeng, L Hydroxyindole carboxylic acid based inhibitors for oncogenic Src homology-2 domain containing protein tyrosine phosphatase-2 (SHP2) US Patent US9522881 Publication Date 12/20/2016
 
Dual specificity protein phosphatase CDC14A
Name:Dual specificity protein phosphatase CDC14A
Type:n/a
Mol. Mass.:66598.40
Organism:Homo sapiens (Human)
Description:Q9UNH5
Residue:594
BDBM50054344
NameBDBM50054344
Synonyms:CHEMBL3319356 US9844535, ID 11a-1 L97M74
TypeSmall organic molecule
Emp. Form.C28H20IN3O5S
Mol. Mass.637.445
SMILESCn1c(c(I)c2cc(C(O)=O)c(O)cc12)-c1cccc(NC(=O)C(=O)Nc2ccc(cc2)-c2ccsc2)c1