Reaction Details
TargetVasopressin V1b receptor
LigandBDBM260242
Substrate/Competitorn/a
Meas. Tech.Binding Assay
pH7.4±n/a
Temperature277.15±n/a K
IC50 0.16±n/a nM
Commentsextracted
Citation Yoshinaga, MKuwada, TMiyakoshi, NIshizaka, TWakasugi, DShirokawa, SHattori, NShimazaki, Y Azole derivative US Patent US9522914 Publication Date 12/20/2016
 
Vasopressin V1b receptor
Name:Vasopressin V1b receptor
Type:Enzyme
Mol. Mass.:46985.01
Organism:Homo sapiens (Human)
Description:P47901
Residue:424
BDBM260242
NameBDBM260242
Synonyms:US9522914, A-44
TypeSmall organic molecule
Emp. Form.C27H33ClN4O2
Mol. Mass.481.03
SMILESCC(C)NC(=O)Cn1cc(nc1-c1cccc(Cl)c1)-c1ccc(CC(C)N2CCOCC2)cc1