Reaction Details
TargetVasopressin V1b receptor
LigandBDBM260248
Substrate/Competitorn/a
Meas. Tech.Binding Assay
pH7.4±n/a
Temperature277.15±n/a K
IC50 1.4±n/a nM
Commentsextracted
Citation Yoshinaga, MKuwada, TMiyakoshi, NIshizaka, TWakasugi, DShirokawa, SHattori, NShimazaki, Y Azole derivative US Patent US9522914 Publication Date 12/20/2016
 
Vasopressin V1b receptor
Name:Vasopressin V1b receptor
Type:Enzyme
Mol. Mass.:46985.01
Organism:Homo sapiens (Human)
Description:P47901
Residue:424
BDBM260248
NameBDBM260248
Synonyms:US9522914, B-01
TypeSmall organic molecule
Emp. Form.C27H32ClN5O2
Mol. Mass.494.028
SMILESCC(C)NC(=O)Cn1nc(nc1-c1cccc(Cl)c1)-c1ccc(CCN2C3CCC2COC3)cc1