Reaction Details
TargetVasopressin V1b receptor
LigandBDBM260347
Substrate/Competitorn/a
Meas. Tech.Binding Assay
pH7.4±n/a
Temperature277.15±n/a K
IC50 0.61±n/a nM
Commentsextracted
Citation Yoshinaga, MKuwada, TMiyakoshi, NIshizaka, TWakasugi, DShirokawa, SHattori, NShimazaki, Y Azole derivative US Patent US9522914 Publication Date 12/20/2016
 
Vasopressin V1b receptor
Name:Vasopressin V1b receptor
Type:Enzyme
Mol. Mass.:46985.01
Organism:Homo sapiens (Human)
Description:P47901
Residue:424
BDBM260347
NameBDBM260347
Synonyms:US9522914, D-36
TypeSmall organic molecule
Emp. Form.C28H33ClFN5O3
Mol. Mass.542.045
SMILESCC(C)NC(=O)Cc1nn(-c2ccc(CC(C)N3C4CCC3COC4)cc2)c(=O)n1-c1ccc(F)c(Cl)c1