Reaction Details
TargetVasopressin V1b receptor
LigandBDBM260352
Substrate/Competitorn/a
Meas. Tech.Binding Assay
pH7.4±n/a
Temperature277.15±n/a K
IC50 2.7±n/a nM
Commentsextracted
Citation Yoshinaga, MKuwada, TMiyakoshi, NIshizaka, TWakasugi, DShirokawa, SHattori, NShimazaki, Y Azole derivative US Patent US9522914 Publication Date 12/20/2016
 
Vasopressin V1b receptor
Name:Vasopressin V1b receptor
Type:Enzyme
Mol. Mass.:46985.01
Organism:Homo sapiens (Human)
Description:P47901
Residue:424
BDBM260352
NameBDBM260352
Synonyms:US9522914, D-41
TypeSmall organic molecule
Emp. Form.C29H36FN5O5
Mol. Mass.553.625
SMILESCOc1cc(ccc1F)-n1c(CC(=O)NC(C)C)nn(-c2ccc(CCN3C4CCC3COC4)c(OC)c2)c1=O