Reaction Details
TargetReplication protein A 70 kDa DNA-binding subunit
LigandBDBM61188
Substrate/Competitorn/a
Meas. Tech.In Vitro Assay
IC50 20300±10700 nM
Citation Turchi, JJShuck, S Materials and method for inhibiting replication protein A and uses thereof US Patent US9533969 Publication Date 1/3/2017
 
Replication protein A 70 kDa DNA-binding subunit
Name:Replication protein A 70 kDa DNA-binding subunit
Type:Enzyme
Mol. Mass.:68139.43
Organism:Homo sapiens (Human)
Description:P27694
Residue:616
BDBM61188
NameBDBM61188
Synonyms:4-[5-(4-methylphenyl)-3-[3-(4-methylphenyl)-1-phenyl-4-pyrazolyl]-3,4-dihydropyrazol-2-yl]-4-oxobutanoic acid 4-[5-(4-methylphenyl)-3-[3-(4-methylphenyl)-1-phenylpyrazol-4-yl]-3,4-dihydropyrazol-2-yl]-4-oxobutanoic acid MLS000680473 US9533969, TDRL-520 | cid_5055219
TypeSmall organic molecule
Emp. Form.C30H28N4O3
Mol. Mass.492.5683
SMILESCc1ccc(cc1)C1=NN(C(C1)c1cn(nc1-c1ccc(C)cc1)-c1ccccc1)C(=O)CCC(O)=O