Reaction Details
TargetReplication protein A 70 kDa DNA-binding subunit
LigandBDBM260648
Substrate/Competitorn/a
Meas. Tech.In Vitro Assay
IC50 71700±33900 nM
Citation Turchi, JJShuck, S Materials and method for inhibiting replication protein A and uses thereof US Patent US9533969 Publication Date 1/3/2017
 
Replication protein A 70 kDa DNA-binding subunit
Name:Replication protein A 70 kDa DNA-binding subunit
Type:Enzyme
Mol. Mass.:68139.43
Organism:Homo sapiens (Human)
Description:P27694
Residue:616
BDBM260648
NameBDBM260648
Synonyms:US9533969, TDRL-521
TypeSmall organic molecule
Emp. Form.C30H28N4O4
Mol. Mass.508.5677
SMILESCOc1ccc(cc1)C1=NN(C(C1)c1cn(nc1-c1ccc(C)cc1)-c1ccccc1)C(=O)CCC(O)=O