Reaction Details
TargetReplication protein A 70 kDa DNA-binding subunit
LigandBDBM260650
Substrate/Competitorn/a
Meas. Tech.In Vitro Assay
IC50>100000±n/a nM
Citation Turchi, JJShuck, S Materials and method for inhibiting replication protein A and uses thereof US Patent US9533969 Publication Date 1/3/2017
 
Replication protein A 70 kDa DNA-binding subunit
Name:Replication protein A 70 kDa DNA-binding subunit
Type:Enzyme
Mol. Mass.:68139.43
Organism:Homo sapiens (Human)
Description:P27694
Residue:616
BDBM260650
NameBDBM260650
Synonyms:US9533969, TDRL-523
TypeSmall organic molecule
Emp. Form.C29H25BrN4O4
Mol. Mass.573.437
SMILESCOc1ccc(cc1)-c1nn(cc1C1CC(=NN1C(=O)CCC(O)=O)c1ccc(Br)cc1)-c1ccccc1