Reaction Details
TargetIntegrin alpha-4/Integrin beta-7/Mucosal addressin cell adhesion molecule 1
LigandBDBM260667
Substrate/Competitorn/a
Meas. Tech.Binding Inhibition Assay
pH9.6±n/a
Temperature277.15±n/a K
IC50 0.27±n/a nM
Commentsextracted
Citation Ueno, HYamamoto, TTakashita, RYokoyama, RSugiura, TKageyama, SAndo, AEda, HEviryanti, AMiyazawa, TKirihara, ATanabe, INakamura, TNoguchi, MShuto, MSugiki, MDohi, M Sulfonamide derivative and medicinal use thereof US Patent US9533985 Publication Date 1/3/2017
 
Integrin alpha-4/Integrin beta-7/Mucosal addressin cell adhesion molecule 1
Name:Integrin alpha-4/Integrin beta-7/Mucosal addressin cell adhesion molecule 1
Synonyms:Mucosal addressin cell adhesion molecule 1 (MAdCAM-1)/Alpha-4 Beta-7 Integrin
Type:Enzyme
Mol. Mass.:n/a
Description:n/a
Components:This complex has 3 components.
Component 1
Name:Mucosal addressin cell adhesion molecule 1
Type:Enzyme
Mol. Mass.:43647.51
Organism:Mus musculus (Mouse)
Description:Q61826
Residue:405
Component 2
Name:Integrin alpha-4
Synonyms:CD49 antigen-like family member D CD49d antigen ITA4_HUMAN Integrin alpha-4 Integrin alpha-IV VLA-4 integrin alpha 4 precursor | integrin alpha-4 precursor
Type:Membrane Protein
Mol. Mass.:114897.35
Organism:Homo sapiens (Human)
Description:P13612
Residue:1032
Component 3
Name:Integrin beta-7
Synonyms:ITB7_HUMAN Integrin alpha-4/beta-7 Integrin beta7
Type:Membrane Protein
Mol. Mass.:86893.88
Organism:Homo sapiens (Human)
Description:P26010
Residue:798
BDBM260667
NameBDBM260667
Synonyms:US9533985, 55
TypeSmall organic molecule
Emp. Form.C31H23F2N9O7S
Mol. Mass.703.632
SMILESCn1c2cnccc2c(=O)n(-c2ccc(C[C@H](NC(=O)c3c(F)cc(NS(=O)(=O)c4ccc(nc4)-n4cncn4)cc3F)C(O)=O)cc2)c1=O