Reaction Details
TargetRho-associated protein kinase 2
LigandBDBM163433
Substrate/Competitorn/a
Meas. Tech.Fluorescent Polarization Assay
Temperature296.15±n/a K
IC50 1600±0 nM
Commentsextracted
Citation McKerracher, LBond, LM Treatment of cerebral cavernous malformations and cerebral aneurysms with Rho kinase inhibitors US Patent US9687483 Publication Date 6/27/2017
 
Rho-associated protein kinase 2
Name:Rho-associated protein kinase 2
Type:Protein
Mol. Mass.:160370.90
Organism:Rattus norvegicus (Rat)
Description:Q62868
Residue:1388
BDBM163433
NameBDBM163433
Synonyms:BA-1049 US9687483, 1
TypeSmall organic molecule
Emp. Form.C16H21N3O2S
Mol. Mass.319.422
SMILESC[C@@H](N)C1CCN(CC1)S(=O)(=O)c1cccc2cnccc12