Reaction Details
TargetIntegrase
LigandBDBM294709
Substrate/Competitorn/a
Meas. Tech.Anti-HIV Activity MT4 Assay
IC50 3.00±n/a nM
Citation Johns, BAVelthuisen, EJWeatherhead, JGSuwandi, LTemelkoff, D Isoindoline derivatives for use in the treatment of a viral infection US Patent US10112899 Publication Date 10/30/2018
 
Integrase
Name:Integrase
Synonyms:Human immunodeficiency virus type 1 integrase
Type:PROTEIN
Mol. Mass.:32231.48
Organism:Human immunodeficiency virus 1
Description:ChEMBL_90865
Residue:288
BDBM294709
NameBDBM294709
Synonyms:US10112899, Example 187
TypeSmall organic molecule
Emp. Form.C34H37F2NO6
Mol. Mass.593.6575
SMILESCOc1ccc(cc1F)C(=O)N1Cc2c(C1)c(C)c(-c1cc(F)c3OCCCc3c1C)c([C@H](OC(C)(C)C)C(O)=O)c2C