Reaction Details
TargetTyrosine-protein kinase JAK1 [866-1154]
LigandBDBM50332294
Substrate/Competitorn/a
Meas. Tech.Kinase Assay
pH7.5±n/a
IC50 20.0±n/a nM
Commentsextracted
Citation Bursulaya, BFisch, ALajiness, JPMachauer, RMalekar, SPetrassi, HMRamazani, FRemond, AUllrich, TUsselmann, PVangrevelinghe, E Substituted indazoles for treating tendon and/or ligament injuries US Patent US10112907 Publication Date 10/30/2018
 
Tyrosine-protein kinase JAK1 [866-1154]
Name:Tyrosine-protein kinase JAK1 [866-1154]
Type:Protein
Mol. Mass.:33185.74
Organism:Homo sapiens (Human)
Description:P23458[866-1154]
Residue:289
BDBM50332294
NameBDBM50332294
Synonyms:CHEMBL1287853 US10112907, Example 00018 US10766894, Compound TABLE 1.3 US11384069, Example T-5
TypeSmall organic molecule
Emp. Form.C27H36N6O3S
Mol. Mass.524.678
SMILESCc1cnc(Nc2ccc(OCCN3CCCC3)cc2)nc1Nc1cccc(c1)S(=O)(=O)NC(C)(C)C