Reaction Details
TargetTyrosine-protein kinase JAK2 [808-1132]
LigandBDBM294911
Substrate/Competitorn/a
Meas. Tech.Kinase Assay
pH7.5±n/a
IC50 0.700±n/a nM
Commentsextracted
Citation Bursulaya, BFisch, ALajiness, JPMachauer, RMalekar, SPetrassi, HMRamazani, FRemond, AUllrich, TUsselmann, PVangrevelinghe, E Substituted indazoles for treating tendon and/or ligament injuries US Patent US10112907 Publication Date 10/30/2018
 
Tyrosine-protein kinase JAK2 [808-1132]
Name:Tyrosine-protein kinase JAK2 [808-1132]
Type:Protein
Mol. Mass.:39171.39
Organism:Homo sapiens (Human)
Description:O60674[808-1132]
Residue:335
BDBM294911
NameBDBM294911
Synonyms:US10112907, Example 00020 US11203595, TABLE 1.5
TypeSmall organic molecule
Emp. Form.C14H14ClFN8
Mol. Mass.348.766
SMILESC[C@H](Nc1ncc(Cl)c(Nc2cc(C)[nH]n2)n1)c1ncc(F)cn1