Reaction Details
TargetTyrosine-protein kinase JAK3 [811-1124]
LigandBDBM294911
Substrate/Competitorn/a
Meas. Tech.Kinase Assay
pH7.5±n/a
IC50 60.0±n/a nM
Commentsextracted
Citation Bursulaya, BFisch, ALajiness, JPMachauer, RMalekar, SPetrassi, HMRamazani, FRemond, AUllrich, TUsselmann, PVangrevelinghe, E Substituted indazoles for treating tendon and/or ligament injuries US Patent US10112907 Publication Date 10/30/2018
 
Tyrosine-protein kinase JAK3 [811-1124]
Name:Tyrosine-protein kinase JAK3 [811-1124]
Type:Protein
Mol. Mass.:35601.85
Organism:Homo sapiens (Human)
Description:P52333[811-1124]
Residue:314
BDBM294911
NameBDBM294911
Synonyms:US10112907, Example 00020 US11203595, TABLE 1.5
TypeSmall organic molecule
Emp. Form.C14H14ClFN8
Mol. Mass.348.766
SMILESC[C@H](Nc1ncc(Cl)c(Nc2cc(C)[nH]n2)n1)c1ncc(F)cn1