Reaction Details
TargetTyrosine-protein kinase JAK2 [808-1132]
LigandBDBM294912
Substrate/Competitorn/a
Meas. Tech.Kinase Assay
pH7.5±n/a
IC50 150±n/a nM
Commentsextracted
Citation Bursulaya, BFisch, ALajiness, JPMachauer, RMalekar, SPetrassi, HMRamazani, FRemond, AUllrich, TUsselmann, PVangrevelinghe, E Substituted indazoles for treating tendon and/or ligament injuries US Patent US10112907 Publication Date 10/30/2018
 
Tyrosine-protein kinase JAK2 [808-1132]
Name:Tyrosine-protein kinase JAK2 [808-1132]
Type:Protein
Mol. Mass.:39171.39
Organism:Homo sapiens (Human)
Description:O60674[808-1132]
Residue:335
BDBM294912
NameBDBM294912
Synonyms:US10112907, Example 00021
TypeSmall organic molecule
Emp. Form.C18H18F3N5O2
Mol. Mass.393.363
SMILESNC(=O)c1cn(nc1Nc1ccc(cc1)C(F)(F)F)[C@H]1CC[C@@H](O)C[C@@H]1[N+]#[C-]