Reaction Details
TargetNon-receptor tyrosine-protein kinase TYK2 [888-1187]
LigandBDBM50402074
Substrate/Competitorn/a
Meas. Tech.Kinase Assay
pH7.5±n/a
IC50 140±n/a nM
Commentsextracted
Citation Bursulaya, BFisch, ALajiness, JPMachauer, RMalekar, SPetrassi, HMRamazani, FRemond, AUllrich, TUsselmann, PVangrevelinghe, E Substituted indazoles for treating tendon and/or ligament injuries US Patent US10112907 Publication Date 10/30/2018
 
Non-receptor tyrosine-protein kinase TYK2 [888-1187]
Name:Non-receptor tyrosine-protein kinase TYK2 [888-1187]
Type:Protein
Mol. Mass.:34527.73
Organism:Homo sapiens (Human)
Description:P29597[888-1187]
Residue:300
BDBM50402074
NameBDBM50402074
Synonyms:CHEMBL2206059 US10766894, Compound TABLE 1.9 | US11203595, TABLE 1.9
TypeSmall organic molecule
Emp. Form.C17H21N5O2S
Mol. Mass.359.446
SMILESCS(=O)(=O)NCc1nc2cnc3[nH]ccc3c2n1[C@@H]1C[C@H]2CC[C@@H]1C2