Reaction Details
TargetTyrosine-protein kinase JAK3 [811-1124]
LigandBDBM50021656
Substrate/Competitorn/a
Meas. Tech.Kinase Assay
pH7.5±n/a
IC50 250±n/a nM
Commentsextracted
Citation Bursulaya, BFisch, ALajiness, JPMachauer, RMalekar, SPetrassi, HMRamazani, FRemond, AUllrich, TUsselmann, PVangrevelinghe, E Substituted indazoles for treating tendon and/or ligament injuries US Patent US10112907 Publication Date 10/30/2018
 
Tyrosine-protein kinase JAK3 [811-1124]
Name:Tyrosine-protein kinase JAK3 [811-1124]
Type:Protein
Mol. Mass.:35601.85
Organism:Homo sapiens (Human)
Description:P52333[811-1124]
Residue:314
BDBM50021656
NameBDBM50021656
Synonyms:BARICITINIB LY-3009104 US10766894, Compound TABLE 1.19 US11203595, TABLE 1.19 US20230416237, Example baricitinib
TypeSmall organic molecule
Emp. Form.C16H17N7O2S
Mol. Mass.371.417
SMILESCCS(=O)(=O)N1CC(CC#N)(C1)n1cc(cn1)-c1ncnc2[nH]ccc12