Reaction Details
TargetPhosphatidylinositol 4,5-bisphosphate 3-kinase catalytic subunit gamma isoform
LigandBDBM295114
Substrate/Competitorn/a
Meas. Tech.TR-FRET Adapta Assay for PI 3-Kinase Gamma (E), PI 3-Kinase Delta (F)
pH7.5±n/a
IC50<3.00±n/a nM
Commentsextracted
Citation Bellenie, BRBloomfield, GCBruce, ICulshaw, AJHall, ECHollingworth, GJNeef, JSpendiff, MWatson, SJ Amino pyridine derivatives as phosphatidylinositol 3-kinase inhibitors US Patent US10112926 Publication Date 10/30/2018
 
Phosphatidylinositol 4,5-bisphosphate 3-kinase catalytic subunit gamma isoform
Name:Phosphatidylinositol 4,5-bisphosphate 3-kinase catalytic subunit gamma isoform
Type:Enzyme Subunit
Mol. Mass.:126470.30
Organism:Homo sapiens (Human)
Description:P48736
Residue:1102
BDBM295114
NameBDBM295114
Synonyms:3-(6-Amino-5-(3-methylisoxazol-5-yl)pyridin-3-yl)-N-((4-(hydroxymethyl)tetrahydro-2H-pyran-4-yl)methyl)-4-methylbenzenesulfonamide | US10112926, Example 37.1
TypeSmall organic molecule
Emp. Form.C23H28N4O5S
Mol. Mass.472.557
SMILESCc1cc(on1)-c1cc(cnc1N)-c1cc(ccc1C)S(=O)(=O)NCC1(CO)CCOCC1