Reaction Details
TargetIsocitrate dehydrogenase [NADP] cytoplasmic [R132H]
LigandBDBM247601
Substrate/Competitorn/a
Meas. Tech.Mutant IDH1 Biochemical Assay: LC-MS Detection of 2-HG
pH7.4±n/a
Temperature298.15±n/a K
IC50 5.00±n/a nM
Commentsextracted
Citation Caferro, TRChen, ZCho, YSCostales, AQLevell, JRLiu, GManning, JRSendzik, MShafer, CShultz, MDSutton, JCWang, YZhao, Q 3-pyrimidin-4-yl-oxazolidin-2-ones as inhibitors of mutant IDH US Patent US10112931 Publication Date 10/30/2018
 
Isocitrate dehydrogenase [NADP] cytoplasmic [R132H]
Name:Isocitrate dehydrogenase [NADP] cytoplasmic [R132H]
Type:Protein
Mol. Mass.:46641.74
Organism:Homo sapiens (Human)
Description:Human IDH1 R132H (SEQ ID No. 2 in patent). First three are removed. Google patent parsed wrong.
Residue:414
BDBM247601
NameBDBM247601
Synonyms:US10112931, Example 201 US9688672, Example 201
TypeSmall organic molecule
Emp. Form.C22H20F4N6O3
Mol. Mass.492.4262
SMILESC[C@@H](O)[C@H]1COC(=O)N1c1ccnc(NC(C)c2ncc(cn2)-c2cccc(c2F)C(F)(F)F)n1