Reaction Details
TargetIsocitrate dehydrogenase [NADP] cytoplasmic [R132H]
LigandBDBM247707
Substrate/Competitorn/a
Meas. Tech.Fluorescence Biochemical Assay
pH7.5±n/a
Temperature298.15±n/a K
IC50 3.00±n/a nM
Commentsextracted
Citation Caferro, TRChen, ZCho, YSCostales, AQLevell, JRLiu, GManning, JRSendzik, MShafer, CShultz, MDSutton, JCWang, YZhao, Q 3-pyrimidin-4-yl-oxazolidin-2-ones as inhibitors of mutant IDH US Patent US10112931 Publication Date 10/30/2018
 
Isocitrate dehydrogenase [NADP] cytoplasmic [R132H]
Name:Isocitrate dehydrogenase [NADP] cytoplasmic [R132H]
Type:Protein
Mol. Mass.:46641.74
Organism:Homo sapiens (Human)
Description:Human IDH1 R132H (SEQ ID No. 2 in patent). First three are removed. Google patent parsed wrong.
Residue:414
BDBM247707
NameBDBM247707
Synonyms:US10112931, Example 309 US9688672, Example 309
TypeSmall organic molecule
Emp. Form.C20H20Cl2N6O3
Mol. Mass.463.317
SMILESC[C@@H](O)[C@H]1COC(=O)N1c1cc(Cl)nc(N[C@@H](C)c2cn(cn2)-c2ccc(Cl)cc2)n1