Reaction Details
TargetPhosphatidylinositol 3-kinase regulatory subunit alpha
LigandBDBM295687
Substrate/Competitorn/a
Meas. Tech.p110alpha (Alpha) PI3K Binding Assay
Ki 0.967±n/a nM
Citation Braun, MHanan, EStaben, STHeald, RAMacLeod, CElliott, R Benzoxazepin oxazolidinone compounds and methods of use US Patent US10112932 Publication Date 10/30/2018
 
Phosphatidylinositol 3-kinase regulatory subunit alpha
Name:Phosphatidylinositol 3-kinase regulatory subunit alpha
Type:Protein
Mol. Mass.:83592.82
Organism:Homo sapiens (Human)
Description:P27986
Residue:724
BDBM295687
NameBDBM295687
Synonyms:US10851091, U.S. Pat. No. 8,263,633 No. 356 | US8242104, Compound 356
TypeSmall organic molecule
Emp. Form.C23H26N4O4S
Mol. Mass.454.542
SMILESCC(C)(O)Cn1cc(cn1)-c1ccc2-c3nc(sc3CCOc2c1)N1C(=O)OCC1(C)C