Reaction Details
TargetP2X purinoceptor 7
LigandBDBM254291
Substrate/Competitorn/a
Meas. Tech.Radioligand Binding
Ki 2.50±n/a nM
Citation Alcazar Vaca, MJAllison, BDAndres Gil, JIChrovian, CCCoate, HRDe Angelis, MDeng, XDvorak, CAGelin, CFLetavic, MALiang, JTMani, NSRech, JCSavall, BMSoyode-Johnson, AStenne, BMSwanson, DMWall, JL P2X7 modulators and methods of use US Patent US10112937 Publication Date 10/30/2018
 
P2X purinoceptor 7
Name:P2X purinoceptor 7
Type:Protein
Mol. Mass.:68403.50
Organism:Rattus norvegicus (Rat)
Description:Q64663
Residue:595
BDBM254291
NameBDBM254291
Synonyms:US10112937, Example 188 US10703749, Example 188 | US9464084, 188
TypeSmall organic molecule
Emp. Form.C19H17F3N6O
Mol. Mass.402.3731
SMILESC[C@H]1N(CCc2c1nnn2-c1ncccn1)C(=O)c1cccc(c1C)C(F)(F)F