Reaction Details
TargetP2X purinoceptor 7
LigandBDBM254326
Substrate/Competitorn/a
Meas. Tech.Radioligand Binding
Ki 2.80±n/a nM
Citation Alcazar Vaca, MJAllison, BDAndres Gil, JIChrovian, CCCoate, HRDe Angelis, MDeng, XDvorak, CAGelin, CFLetavic, MALiang, JTMani, NSRech, JCSavall, BMSoyode-Johnson, AStenne, BMSwanson, DMWall, JL P2X7 modulators and methods of use US Patent US10112937 Publication Date 10/30/2018
 
P2X purinoceptor 7
Name:P2X purinoceptor 7
Type:Protein
Mol. Mass.:68403.50
Organism:Rattus norvegicus (Rat)
Description:Q64663
Residue:595
BDBM254326
NameBDBM254326
Synonyms:US10112937, Example 228 US10703749, Example 228 | US9464084, 228
TypeSmall organic molecule
Emp. Form.C17H12F5N7O
Mol. Mass.425.3155
SMILESC[C@H]1Cc2c(CN1C(=O)c1ccnc(c1F)C(F)(F)F)nnn2-c1ncc(F)cn1