Reaction Details
TargetP2X purinoceptor 7
LigandBDBM254364
Substrate/Competitorn/a
Meas. Tech.Radioligand Binding
Ki 1.60±n/a nM
Citation Alcazar Vaca, MJAllison, BDAndres Gil, JIChrovian, CCCoate, HRDe Angelis, MDeng, XDvorak, CAGelin, CFLetavic, MALiang, JTMani, NSRech, JCSavall, BMSoyode-Johnson, AStenne, BMSwanson, DMWall, JL P2X7 modulators and methods of use US Patent US10112937 Publication Date 10/30/2018
 
P2X purinoceptor 7
Name:P2X purinoceptor 7
Type:Protein
Mol. Mass.:68403.50
Organism:Rattus norvegicus (Rat)
Description:Q64663
Residue:595
BDBM254364
NameBDBM254364
Synonyms:US10112937, Example 271 US10703749, Example 271 | US9464084, 271
TypeSmall organic molecule
Emp. Form.C18H14F4N6O
Mol. Mass.406.337
SMILESC[C@H]1N(CCc2c1nnn2-c1ncccn1)C(=O)c1cccc(c1F)C(F)(F)F