Reaction Details
TargetVoltage-dependent L-type calcium channel subunit alpha-1C
LigandBDBM164208
Substrate/Competitorn/a
Meas. Tech.Nav1.5 Assay
pH7.4±n/a
IC50 6120±n/a nM
Commentsextracted
Citation PubChem, PCPajouhesh, HHolland, RZhang, LPajouhesh, HLamontagne, JWhelan, B Benzimidazole inhibitors of the sodium channel US Patent US9688615 Publication Date 6/27/2017
 
Voltage-dependent L-type calcium channel subunit alpha-1C
Name:Voltage-dependent L-type calcium channel subunit alpha-1C
Type:Enzyme Catalytic Domain
Mol. Mass.:248979.79
Organism:Homo sapiens (Human)
Description:Calcium channel (Type L) 0 HUMAN::Q13936
Residue:2221
BDBM164208
NameBDBM164208
Synonyms:US9688615, 19
TypeSmall organic molecule
Emp. Form.C19H22F6N4O
Mol. Mass.436.3946
SMILESCC(C)(C)NC(=O)CN1CC(Cc2nc3c(cc(cc3[nH]2)C(F)(F)F)C(F)(F)F)C1