Reaction Details
TargetLysine-specific demethylase 4C
LigandBDBM296110
Substrate/Competitorn/a
Meas. Tech.JMJD2C Assay
Temperature298.15±n/a K
IC50<100±n/a nM
Commentsextracted
Citation Boloor, AKanouni, TStafford, JAVeal, JMWallace, MB Histone demethylase inhibitors US Patent US10112940 Publication Date 10/30/2018
 
Lysine-specific demethylase 4C
Name:Lysine-specific demethylase 4C
Type:Protein
Mol. Mass.:119979.01
Organism:Homo sapiens (Human)
Description:Q9H3R0
Residue:1056
BDBM296110
NameBDBM296110
Synonyms:2-(4-{[4-(2-amino-1-methyl-ethyl)-phenyl] - methyl-amino}-phenoxy)-pyrido[3,4- d]pyrimidin-4-ol US10202381, Example 37 US10611763, Example 37 US11535616, Example 37
TypeSmall organic molecule
Emp. Form.C23H23N5O2
Mol. Mass.401.461
SMILESCC(CN)c1ccc(cc1)N(C)c1ccc(Oc2nc(O)c3ccncc3n2)cc1