Reaction Details
TargetCytochrome P450 2C9
LigandBDBM50090677
Substrate/Competitorn/a
Meas. Tech.Extracellular Cytochrome P450 Inhibition Assay
pH7.4±n/a
IC50 210±n/a nM
Commentsextracted
Citation PubChem, PCBrittain, JEKing, CDStearns, BA DP2 antagonist and uses thereof US Patent US9688624 Publication Date 6/27/2017
 
Cytochrome P450 2C9
Name:Cytochrome P450 2C9
Type:Enzyme
Mol. Mass.:55636.33
Organism:Homo sapiens (Human)
Description:P11712
Residue:490
BDBM50090677
NameBDBM50090677
Synonyms:4-Amino-N-(2-phenyl-2H-pyrazol-3-yl)-benzenesulfonamide CHEMBL1109 Sulfabid US9180183, Sulfaphenazole
TypeSmall organic molecule
Emp. Form.C15H14N4O2S
Mol. Mass.314.362
SMILESNc1ccc(cc1)S(=O)(=O)Nc1ccnn1-c1ccccc1